Home > Visual Studio > Visual Studio Error C3254

Visual Studio Error C3254

One thing, though, how could iostream shut off in the main? and a lot of them.) Play with the extra source I've posted. "Move the operators outside of the class." That will directly solve nothing, but he may solve this issue as Note: C++ does not support default-int c:\documents and settings\server22\my documents\visual studio 2008\projects\x10testapp\x10testapp\fflyusb.h 251 Error 3 error C4430: missing type specifier - int assumed. Personal Open source Business Explore Sign up Sign in Pricing Blog Support Search GitHub This repository Watch 705 Star 6,848 Fork 1,784 godotengine/godot Code Issues 1,418 Pull requests 73 Projects http://discusswire.com/visual-studio/visual-studio-2010-sdk-sp1.html

Dev centers Windows Office Visual Studio Microsoft Azure More... Skip to content Ignore Learn more Please note that GitHub no longer supports old versions of Firefox. Furthermore, I get huge amounts of syntax errors that should not be when I try: Code: template class thread_safety = ptr_thread_dangerous, int Bits = 32> class mad_shared_ptr { templatesee here

Back to top Back to General Programming Old topic! Some help would be really nice. Note: C++ does not support default-int modules\visual_script\visual_script_nodes.cpp(2414): error C2143: syntax error: missing ';' before '++' modules\visual_script\visual_script_nodes.cpp(2414): error C2059: syntax error: ')' modules\visual_script\visual_script_nodes.cpp(2414): error C2334: unexpected token(s) preceding '{'; skipping apparent function How much more than my mortgage should I charge for rent?

All these errors appeared at once. If you wish to continue this conversation start a new topic. CornedBee "There is not now, nor has there ever been, nor will there ever be, any programming language in which it is the least bit difficult to write bad code." - It is no longer part of the standard for C, but it is nevertheless, included in the very latest Pelles C versions.

Player claims their wizard character knows everything (from books). Isn't this what would be happen if the .h files disappeared? When I got here the games were all being programmed in VS2003. https://www.daniweb.com/programming/software-development/threads/397184/c-unknown-errors What?

Nor will it in VS. NOTE that I only get the errors below after I link in SDL too. You are still doing it wrong. jimdavis08-04-2010, 03:20 PMWell, I was actually able to get it compiled.

Others have really weird errors in them like "no default constructor exists for class"std::basic_ostreamhttp://compiler.error.c3254.winadvice.org/ I have no idea what happened. Creating a game, from start to finish Recent additions How to create a shared library on Linux with GCC - December 30, 2011 Enum classes and nullptr in C++11 - Outside of your DOS world, your header file is meaningless. 04-13-2009 #13 phantomotap View Profile View Forum Posts Master Apprentice Join Date Jan 2008 Posts 5,087 "Your shorter version compiles, but

Soma Code: #include #include "test.h" #include "test2.h" int main2(); int main() { test a, b; test2 c, d; a == b; c == d; main2(); return(0); } Code: #include have a peek at these guys I am using a class to make an array of 10 objects. Your code is full of comparisons where you've used = instead of == You've screwed up the braces in the function void Player::attack You've made some bad choices about what to jimdavis08-04-2010, 03:11 PMThis was very helpful, but it appears that the FadeDemo Project is a converted VS 2008 project.

You just defined a class Foo, and a global function bar(Foo&) that is a friend of that class. I am trying to use VS 2003 so I can use C++.Net. In the .cpp files, when I declare the class constructor //initializes a poker game aPokerGame::aPokerGame(void) { stopPlaying = 'n'; } I get the line under the class name aPokerGame and this check over here scons: done reading SConscript files.

Whenever you instantiate this template with a type S, you also define a global function template bar(Foo&). Trick or Treat polyglot Is the set cover problem NP-complete when the cardinality of the collection of sets is equal to the cardinality of the universe? I am trying to get all of our stuff brought up to date anyway.

I only recommend use Visual C++ 2008SP1 with C++/CLI, and not for Windows Forms but for IJW Interop to ease Heber native-to-.NET DLL adaptations.

  1. Thanks in advance.
  2. I want to get things up to VS2010, but there are some technical issues with that, that I am working through when I can.
  3. Rajesh8367 2 posts since Nov 2016 Newbie Member Add values from several columns from two different tables?
  4. Things to consider when running public NTP servers Simple Craps game more hot questions question feed lang-cpp about us tour help blog chat data legal privacy policy work here advertising info
  5. Search Engine Optimisation provided by DragonByte SEO v2.0.32 (Pro) - vBulletin Mods & Addons Copyright © 2016 DragonByte Technologies Ltd. Версия для печати темы Нажмите сюда для просмотра этой темы в

I did, however, make a change to the x10errhd.c to include some other headers. Here's my code so far : import java.awt.*; import java.awt.event.ActionEvent; import java.awt.event.ActionListener; import java.util.Random; import javax.swing.*; public class Gui { ... Originally Posted by Salem You mean it's included as a crutch to help ancient programmers limp along without them having to relearn too much. Nunix 1 post since Nov 2016 Newbie Member More Recommended Articles About Us Contact Us Donate Advertising Vendor Program Terms of Service Newsletter Archive Community Forums Recent Articles © 2002 -

Originally Posted by Salem You mean it's included as a crutch to help ancient programmers limp along without them having to relearn too much. I had done both before I got it to compile. Note: C++ does not support default-int c:\documents and settings\server22\my documents\visual studio 2008\projects\x10testapp\x10testapp\fflyusb.h 251 Error 6 error C4430: missing type specifier - int assumed. http://discusswire.com/visual-studio/visual-studio-shortcut.html Site Content Copyright Valve Corporation 1998-2015, All Rights Reserved.

C/C++ Building Reference C/C++ Build Errors Compiler Errors C2900 Through C3499 Compiler Errors C2900 Through C3499 Compiler Error C3254 Compiler Error C3254 Compiler Error C3254 Compiler Error C2902 Compiler Error C2903 The content you requested has been removed. We recommend upgrading to the latest Safari, Google Chrome, or Firefox. Instantiate Foo, you get bar(Foo&).

If you wish to continue this conversation start a new topic. Make Foo a template: Code: template class Foo { friend void bar(Foo& f) { f.wooble(); } void wooble(); }; Now you've defined a class template Foo with parameter T. I am getting this error when I compile: Error 8 error C3254: 'FireFlyUSB' : class contains explicit override 'GetLastWin32Error' but does not derive from an interface that contains the function declaration Let me know what I can do.

Solutions? Password Register Games FAQ Today's Posts Search Search Forums Tag Search Advanced Search Google Search My Threads and Posts My Posts My Threads Steam Game Discussions # - C D -

© Copyright 2017 discusswire.com. All rights reserved.